(CF3SO2)2N anion

Reaction thermochemistry data

Data compiled by: John E. Bartmess

Individual Reactions

C2F6NO4S2- + Hydrogen cation = C2HF6NO4S2

By formula: C2F6NO4S2- + H+ = C2HF6NO4S2

Quantity Value Units Method Reference Comment
Δr293.3 ± 2.3kcal/molG+TSLeito, Raamat, et al., 2009gas phase
Δr298.6 ± 2.3kcal/molG+TSKoppel, Koppel, et al., 1998gas phase; corrected from typo in literature: I. Koppel, private Communication, 1998
Quantity Value Units Method Reference Comment
Δr286.5 ± 2.0kcal/molIMRELeito, Raamat, et al., 2009gas phase
Δr291.8 ± 2.0kcal/molIMREKoppel, Koppel, et al., 1998gas phase; corrected from typo in literature: I. Koppel, private Communication, 1998

Gas phase ion energetics data

Data compiled by: John E. Bartmess

Protonation reactions

C2F6NO4S2- + Hydrogen cation = C2HF6NO4S2

By formula: C2F6NO4S2- + H+ = C2HF6NO4S2

Quantity Value Units Method Reference Comment
Δr293.3 ± 2.3kcal/molG+TSLeito, Raamat, et al., 2009gas phase
Δr298.6 ± 2.3kcal/molG+TSKoppel, Koppel, et al., 1998gas phase; corrected from typo in literature: I. Koppel, private Communication, 1998
Quantity Value Units Method Reference Comment
Δr286.5 ± 2.0kcal/molIMRELeito, Raamat, et al., 2009gas phase
Δr291.8 ± 2.0kcal/molIMREKoppel, Koppel, et al., 1998gas phase; corrected from typo in literature: I. Koppel, private Communication, 1998

References

Leito, Raamat, et al., 2009
Leito, I.; Raamat, E.; Kutt, A.; Saame, J.; Kipper, K.; Koppel, I.A.; Koppel, I.; Zhang, M.; Mishima, M.; Yagupolskii, L.M.; Garlyauskayte, R.Y.; Filatov, A.A., Revision of the Gas-Phase Acidity Scale below 300 kcal mol(-1), J. Phys. Chem. A, 2009, 113, 29, 8421-8424, https://doi.org/10.1021/jp903780k . [all data]

Koppel, Koppel, et al., 1998
Koppel, I.; Koppel, J.; Maria, P.C.; Gal, J.F.; Notario, R.; Vlasov, V.M.; Taft, R.W., Comparison of Bronsted acidities of neutral NH-acids in gas phase, dimethyl sulfoxide and water, Int. J. Mass Spectrom., 1998, 175, 1-2, 61-69, https://doi.org/10.1016/S0168-1176(98)00113-X . [all data]