2,4,6-triSO2CF3-C6H2CH2 anion

Gas phase ion energetics data

Data compiled by: John E. Bartmess

Protonation reactions

C10H4F9O6S3- + Hydrogen cation = C10H5F9O6S3

By formula: C10H4F9O6S3- + H+ = C10H5F9O6S3

Quantity Value Units Method Reference Comment
Δr305.7 ± 2.0kcal/molIMREKoppel, Taft, et al., 1994gas phase

References

Koppel, Taft, et al., 1994
Koppel, I.A.; Taft, R.W.; Anvia, F.; Zhu, S.Z.; Hu, L.Q.; Sung, K.S.; Desmarteau, D.D.; Yagupolskii, L.M., The Gas-Phase Acidities of Very Strong Neutral Bronsted Acids, J. Am. Chem. Soc., 1994, 116, 7, 3047, https://doi.org/10.1021/ja00086a038 . [all data]