mCF3-phenol..Br anion

Gas phase thermochemistry data

Data compiled by: John E. Bartmess

Quantity Value Units Method Reference Comment
Δfgas-259.3 ± 2.1kcal/molTherPaul and Kebarle, 1990ΔGaff at 423 K

References

Paul and Kebarle, 1990
Paul, G.J.C.; Kebarle, P., Stabilities in the Gas Phase of the Hydrogen Bonded Complexes, YC6H4OH-X-, of Substituted Phenols, YC6H4OH, with the Halide Anions X-(Cl-, Br-), Can. J. Chem., 1990, 68, 11, 2070, https://doi.org/10.1139/v90-316 . [all data]