arsenic anion

Gas phase thermochemistry data

Data compiled by: John E. Bartmess

Quantity Value Units Method Reference Comment
Δfgas50.54 ± 0.60kcal/molR-EAWalter, Gibson, et al., 2009

References

Walter, Gibson, et al., 2009
Walter, C.W.; Gibson, N.D.; Field, R.L.; Snedden, A.P.; Shapiro, J.Z.; Janczak, C.M.; Hanstorp, D., Electron affinity of arsenic and the fine structure of As- measured using infrared photodetachment threshold spectroscopy, Phys. Rev. A, 2009, 80, 1, 014501, https://doi.org/10.1103/PhysRevA.80.014501 . [all data]