MeAl(OH)O anion

Reaction thermochemistry data

Data compiled by: John E. Bartmess

Individual Reactions

CH4AlO2- + Hydrogen cation = CH5AlO2

By formula: CH4AlO2- + H+ = CH5AlO2

Quantity Value Units Method Reference Comment
Δr1502. ± 17.kJ/molG+TSDamrauer, Krempp, et al., 1991gas phase; Between CF3CH2OH and pyrrole.
Quantity Value Units Method Reference Comment
Δr1475. ± 17.kJ/molIMRBDamrauer, Krempp, et al., 1991gas phase; Between CF3CH2OH and pyrrole.

References

Damrauer, Krempp, et al., 1991
Damrauer, R.; Krempp, M.; Schmidt, M.W.; Gordon, M.S., Gas-Phase Chemistry of the Dimethylaluminum Oxide Ion and Related Aluminum Oxide Ions - Comparison of Reactivity with Siloxide Ions, J. Am. Chem. Soc., 1991, 113, 7, 2393, https://doi.org/10.1021/ja00007a007 . [all data]