F2Si(Me)O anion

Reaction thermochemistry data

Data compiled by: John E. Bartmess

Individual Reactions

CH3F2OSi- + Hydrogen cation = CH4F2OSi

By formula: CH3F2OSi- + H+ = CH4F2OSi

Quantity Value Units Method Reference Comment
Δr1449. ± 17.kJ/molG+TSDamrauer, Simon, et al., 1991gas phase; Between MeCO2H, HCO2H
Quantity Value Units Method Reference Comment
Δr1422. ± 17.kJ/molIMRBDamrauer, Simon, et al., 1991gas phase; Between MeCO2H, HCO2H

References

Damrauer, Simon, et al., 1991
Damrauer, R.; Simon, R.; Krempp, M., Effect of Substituents on the Gas-Phase Acidity of Silanols, J. Am. Chem. Soc., 1991, 113, 12, 4431, https://doi.org/10.1021/ja00012a009 . [all data]