(MeO)3SiO anion

Gas phase ion energetics data

Data compiled by: John E. Bartmess

Protonation reactions

C3H9O4Si- + Hydrogen cation = C3H10O4Si

By formula: C3H9O4Si- + H+ = C3H10O4Si

Quantity Value Units Method Reference Comment
Δr354.8 ± 4.1kcal/molG+TSDamrauer, Simon, et al., 1991gas phase; Between MeSH, tBuSH
Quantity Value Units Method Reference Comment
Δr348.4 ± 4.0kcal/molIMRBDamrauer, Simon, et al., 1991gas phase; Between MeSH, tBuSH

References

Damrauer, Simon, et al., 1991
Damrauer, R.; Simon, R.; Krempp, M., Effect of Substituents on the Gas-Phase Acidity of Silanols, J. Am. Chem. Soc., 1991, 113, 12, 4431, https://doi.org/10.1021/ja00012a009 . [all data]