MeOSi(Me)2O anion

Gas phase ion energetics data

Data compiled by: John E. Bartmess

Protonation reactions

C3H9O2Si- + Hydrogen cation = C3H10O2Si

By formula: C3H9O2Si- + H+ = C3H10O2Si

Quantity Value Units Method Reference Comment
Δr1502. ± 17.kJ/molG+TSDamrauer, Simon, et al., 1991gas phase; between pyrrole, CF3CH2OH
Quantity Value Units Method Reference Comment
Δr1475. ± 17.kJ/molIMRBDamrauer, Simon, et al., 1991gas phase; between pyrrole, CF3CH2OH

References

Damrauer, Simon, et al., 1991
Damrauer, R.; Simon, R.; Krempp, M., Effect of Substituents on the Gas-Phase Acidity of Silanols, J. Am. Chem. Soc., 1991, 113, 12, 4431, https://doi.org/10.1021/ja00012a009 . [all data]