NaBO2 radical anion

Gas phase thermochemistry data

Data compiled by: John E. Bartmess

Quantity Value Units Method Reference Comment
Δfgas-187. ± 11.kcal/molR-EAShevchenko, Iljin, et al., 1976From Na2BO2F; value altered from reference due to conversion from electron convention to ion convention

References

Shevchenko, Iljin, et al., 1976
Shevchenko, V.E.; Iljin, M.K.; Nikitin, O.T.; Sidorov, L.N., Mass-spectrometric study of mixed dimers M2BO2F, Int. J. Mass Spectrom. Ion Phys., 1976, 21, 279. [all data]