CF3COS anion

Gas phase ion energetics data

Data compiled by: John E. Bartmess

Protonation reactions

C2F3OS- + Hydrogen cation = C2HF3OS

By formula: C2F3OS- + H+ = C2HF3OS

Quantity Value Units Method Reference Comment
Δr1337. ± 9.6kJ/molG+TSKoppel, Taft, et al., 1994gas phase
Quantity Value Units Method Reference Comment
Δr1308. ± 8.4kJ/molIMREKoppel, Taft, et al., 1994gas phase

Reaction thermochemistry data

Data compiled by: John E. Bartmess

Individual Reactions

C2F3OS- + Hydrogen cation = C2HF3OS

By formula: C2F3OS- + H+ = C2HF3OS

Quantity Value Units Method Reference Comment
Δr319.5 ± 2.3kcal/molG+TSKoppel, Taft, et al., 1994gas phase
Quantity Value Units Method Reference Comment
Δr312.5 ± 2.0kcal/molIMREKoppel, Taft, et al., 1994gas phase

References

Koppel, Taft, et al., 1994
Koppel, I.A.; Taft, R.W.; Anvia, F.; Zhu, S.Z.; Hu, L.Q.; Sung, K.S.; Desmarteau, D.D.; Yagupolskii, L.M., The Gas-Phase Acidities of Very Strong Neutral Bronsted Acids, J. Am. Chem. Soc., 1994, 116, 7, 3047, https://doi.org/10.1021/ja00086a038 . [all data]