CF3SO2NH anion

Gas phase ion energetics data

Data compiled by: John E. Bartmess

Protonation reactions

CHF3NO2S- + Hydrogen cation = CH2F3NO2S

By formula: CHF3NO2S- + H+ = CH2F3NO2S

Quantity Value Units Method Reference Comment
Δr328.4 ± 2.3kcal/molG+TSKoppel, Taft, et al., 1994gas phase
Quantity Value Units Method Reference Comment
Δr321.3 ± 2.0kcal/molIMREKoppel, Taft, et al., 1994gas phase

Reaction thermochemistry data

Data compiled by: John E. Bartmess

Individual Reactions

CHF3NO2S- + Hydrogen cation = CH2F3NO2S

By formula: CHF3NO2S- + H+ = CH2F3NO2S

Quantity Value Units Method Reference Comment
Δr328.4 ± 2.3kcal/molG+TSKoppel, Taft, et al., 1994gas phase
Quantity Value Units Method Reference Comment
Δr321.3 ± 2.0kcal/molIMREKoppel, Taft, et al., 1994gas phase

References

Koppel, Taft, et al., 1994
Koppel, I.A.; Taft, R.W.; Anvia, F.; Zhu, S.Z.; Hu, L.Q.; Sung, K.S.; Desmarteau, D.D.; Yagupolskii, L.M., The Gas-Phase Acidities of Very Strong Neutral Bronsted Acids, J. Am. Chem. Soc., 1994, 116, 7, 3047, https://doi.org/10.1021/ja00086a038 . [all data]