C6F5CHCN anion

Gas phase ion energetics data

Data compiled by: John E. Bartmess

Protonation reactions

C8HF5N- + Hydrogen cation = 2,3,4,5,6-Pentafluorophenylacetonitrile

By formula: C8HF5N- + H+ = C8H2F5N

Quantity Value Units Method Reference Comment
Δr1398. ± 8.8kJ/molG+TSKoppel, Taft, et al., 1994gas phase
Quantity Value Units Method Reference Comment
Δr1371. ± 8.4kJ/molIMREKoppel, Taft, et al., 1994gas phase

Reaction thermochemistry data

Data compiled by: John E. Bartmess

Individual Reactions

C8HF5N- + Hydrogen cation = 2,3,4,5,6-Pentafluorophenylacetonitrile

By formula: C8HF5N- + H+ = C8H2F5N

Quantity Value Units Method Reference Comment
Δr1398. ± 8.8kJ/molG+TSKoppel, Taft, et al., 1994gas phase
Quantity Value Units Method Reference Comment
Δr1371. ± 8.4kJ/molIMREKoppel, Taft, et al., 1994gas phase

References

Koppel, Taft, et al., 1994
Koppel, I.A.; Taft, R.W.; Anvia, F.; Zhu, S.Z.; Hu, L.Q.; Sung, K.S.; Desmarteau, D.D.; Yagupolskii, L.M., The Gas-Phase Acidities of Very Strong Neutral Bronsted Acids, J. Am. Chem. Soc., 1994, 116, 7, 3047, https://doi.org/10.1021/ja00086a038 . [all data]