PhSO2NH anion

Reaction thermochemistry data

Data compiled by: John E. Bartmess

Individual Reactions

C6H6NO2S- + Hydrogen cation = Benzenesulfonamide

By formula: C6H6NO2S- + H+ = C6H7NO2S

Quantity Value Units Method Reference Comment
Δr333.2 ± 2.0kcal/molIMREKoppel, Taft, et al., 1994gas phase; ΔHf(PhSO2NH2) is probably about -63 kcal/mol

Gas phase ion energetics data

Data compiled by: John E. Bartmess

Protonation reactions

C6H6NO2S- + Hydrogen cation = Benzenesulfonamide

By formula: C6H6NO2S- + H+ = C6H7NO2S

Quantity Value Units Method Reference Comment
Δr333.2 ± 2.0kcal/molIMREKoppel, Taft, et al., 1994gas phase; ΔHf(PhSO2NH2) is probably about -63 kcal/mol

References

Koppel, Taft, et al., 1994
Koppel, I.A.; Taft, R.W.; Anvia, F.; Zhu, S.Z.; Hu, L.Q.; Sung, K.S.; Desmarteau, D.D.; Yagupolskii, L.M., The Gas-Phase Acidities of Very Strong Neutral Bronsted Acids, J. Am. Chem. Soc., 1994, 116, 7, 3047, https://doi.org/10.1021/ja00086a038 . [all data]