PhCH=C(NH2)O anion

Gas phase ion energetics data

Data compiled by: John E. Bartmess

Protonation reactions

C8H8NO- + Hydrogen cation = Benzeneacetamide

By formula: C8H8NO- + H+ = C8H9NO

Quantity Value Units Method Reference Comment
Δr353.4 ± 2.2kcal/molG+TSTaft, 1991gas phase
Quantity Value Units Method Reference Comment
Δr347.7 ± 2.0kcal/molIMRETaft, 1991gas phase

References

Taft, 1991
Taft, R.W., , personal communication, Aug, 1991. [all data]