HOCH2CH2O anion

Reaction thermochemistry data

Data compiled by: John E. Bartmess

Individual Reactions

C2H5O2- + Hydrogen cation = 1,2-Ethanediol

By formula: C2H5O2- + H+ = C2H6O2

Quantity Value Units Method Reference Comment
Δr365.1 ± 2.5kcal/molG+TSCrowder and Bartmess, 1993gas phase
Quantity Value Units Method Reference Comment
Δr360.9 ± 2.0kcal/molIMRECrowder and Bartmess, 1993gas phase

References

Crowder and Bartmess, 1993
Crowder, C.; Bartmess, J., The Gas Phase Acidities of Diols, J. Am. Soc. Mass Spectrom., 1993, 4, 9, 723, https://doi.org/10.1016/1044-0305(93)80051-Y . [all data]