pOMe-benzoate anion

Gas phase ion energetics data

Data compiled by: John E. Bartmess

Electron affinity of neutral species

EAneutral (eV) Method Reference Comment
3.72 ± 0.16D-EAYamdagni, McMahon, et al., 1974

Protonation reactions

C8H7O3- + Hydrogen cation = Benzoic acid, 4-methoxy-

By formula: C8H7O3- + H+ = C8H8O3

Quantity Value Units Method Reference Comment
Δr1426. ± 8.8kJ/molG+TSYamdagni, McMahon, et al., 1974gas phase
Quantity Value Units Method Reference Comment
Δr1397. ± 8.4kJ/molIMREYamdagni, McMahon, et al., 1974gas phase

Reaction thermochemistry data

Data compiled by: John E. Bartmess

Individual Reactions

C8H7O3- + Hydrogen cation = Benzoic acid, 4-methoxy-

By formula: C8H7O3- + H+ = C8H8O3

Quantity Value Units Method Reference Comment
Δr1426. ± 8.8kJ/molG+TSYamdagni, McMahon, et al., 1974gas phase
Quantity Value Units Method Reference Comment
Δr1397. ± 8.4kJ/molIMREYamdagni, McMahon, et al., 1974gas phase

References

Yamdagni, McMahon, et al., 1974
Yamdagni, R.; McMahon, T.B.; Kebarle, P., Substituent Effects on the Intrinsic Acidities of Benzoic Acids Determined by Gas Phase Proton Transfer Equilibria Measurements, J. Am. Chem. Soc., 1974, 96, 12, 4035, https://doi.org/10.1021/ja00819a063 . [all data]