octafluoro-fluorenide anion

Gas phase ion energetics data

Data compiled by: John E. Bartmess

Protonation reactions

C13HF8- + Hydrogen cation = C13H2F8

By formula: C13HF8- + H+ = C13H2F8

Quantity Value Units Method Reference Comment
Δr325.0 ± 2.1kcal/molG+TSTaft and Bordwell, 1988gas phase
Quantity Value Units Method Reference Comment
Δr317.3 ± 2.0kcal/molIMRETaft and Bordwell, 1988gas phase

References

Taft and Bordwell, 1988
Taft, R.W.; Bordwell, F.G., Structural and Solvent Effects Evaluated from Acidities Measured in Dimethyl Sulfoxide and in the Gas Phase, Acc. Chem. Res., 1988, 21, 12, 463, https://doi.org/10.1021/ar00156a005 . [all data]