5-Nitro-m-xylene anion

Gas phase thermochemistry data

Data compiled by: John E. Bartmess

Quantity Value Units Method Reference Comment
Δfgas>-125. ± 9.6kJ/molR-EAMock and Grimsrud, 1989

References

Mock and Grimsrud, 1989
Mock, R.S.; Grimsrud, E.P., Gas-Phase Electron Photodetachment Spectroscopy of the Molecular Anions of Nitroaromatic Hydrocarbons at Atmospheric Pressure, J. Am. Chem. Soc., 1989, 111, 8, 2861, https://doi.org/10.1021/ja00190a020 . [all data]