1H-Isoindole-1,3(2H)-dione, 2-phenyl- anion

Gas phase thermochemistry data

Data compiled by: John E. Bartmess

Quantity Value Units Method Reference Comment
Δfgas-50.3 ± 3.6kcal/molR-EAPaul and Kebarle, 1989ΔGea(423 K) = -25.4±1 kcal/mol, ΔS(est) = -3±3 eu

References

Paul and Kebarle, 1989
Paul, G.; Kebarle, P., Electron Affinities of Cyclic Unsaturated Dicarbonyls: Maleic Anhydrides, Maleimides, and Cyclopentendione, J. Am. Chem. Soc., 1989, 111, 2, 464, https://doi.org/10.1021/ja00184a009 . [all data]