MeCON(Me)O anion

Gas phase ion energetics data

Data compiled by: John E. Bartmess

Protonation reactions

C3H6NO2- + Hydrogen cation = Acetamide, N-hydroxy-N-methyl

By formula: C3H6NO2- + H+ = C3H7NO2

Quantity Value Units Method Reference Comment
Δr1482. ± 9.6kJ/molG+TSDecouzon, Exner, et al., 1990gas phase; Acid: N-methyl acetohydroxamic acid
Quantity Value Units Method Reference Comment
Δr1451. ± 8.4kJ/molIMREDecouzon, Exner, et al., 1990gas phase; Acid: N-methyl acetohydroxamic acid

References

Decouzon, Exner, et al., 1990
Decouzon, M.; Exner, O.; Gal, J.-F.; Maria, P.-C., The Gas-Phase Acidity and the Acidic Site of Acetohydroxamic Acid: an FT-ICR Study, J. Org. Chem., 1990, 55, 13, 3980, https://doi.org/10.1021/jo00300a007 . [all data]