HON=C(Me)O anion

Reaction thermochemistry data

Data compiled by: John E. Bartmess

Individual Reactions

C2H4NO2- + Hydrogen cation = Acetohydroxamic acid

By formula: C2H4NO2- + H+ = C2H5NO2

Quantity Value Units Method Reference Comment
Δr1449. ± 9.6kJ/molG+TSDecouzon, Exner, et al., 1990gas phase; Acid: Acetohydroxamic acid
Quantity Value Units Method Reference Comment
Δr1419. ± 8.4kJ/molIMREDecouzon, Exner, et al., 1990gas phase; Acid: Acetohydroxamic acid

References

Decouzon, Exner, et al., 1990
Decouzon, M.; Exner, O.; Gal, J.-F.; Maria, P.-C., The Gas-Phase Acidity and the Acidic Site of Acetohydroxamic Acid: an FT-ICR Study, J. Org. Chem., 1990, 55, 13, 3980, https://doi.org/10.1021/jo00300a007 . [all data]