I..n3(C3H5)Mn(CO)3 radical anion

Reaction thermochemistry data

Data compiled by: John E. Bartmess

Individual Reactions

CAS Reg. No. 121175-69-7 + Iodine atom = C6H5IMnO3-

By formula: CAS Reg. No. 121175-69-7 + I = C6H5IMnO3-

Quantity Value Units Method Reference Comment
Δr>239.3kJ/molIMRBJones, McDonald, et al., 1989gas phase

References

Jones, McDonald, et al., 1989
Jones, M.T.; McDonald, R.N.; Schell, P.L.; Ali, M.H., Kinetics and Mechanism of Halogen Atom Transfer Reactions between Haloalkanes and Several 17-Electron Transition Metal Complex Negative Ions in the Gas Phase, J. Am. Chem. Soc., 1989, 111, 16, 5983, https://doi.org/10.1021/ja00198a001 . [all data]