I..(CO)4ReCl radical anion

Reaction thermochemistry data

Data compiled by: John E. Bartmess

Individual Reactions

C4ClO4Re + Iodine atom = C4ClIO4Re-

By formula: C4ClO4Re + I = C4ClIO4Re-

Quantity Value Units Method Reference Comment
Δr>239.3kJ/molIMRBJones, McDonald, et al., 1989gas phase

Gas phase thermochemistry data

Data compiled by: John E. Bartmess

Quantity Value Units Method Reference Comment
Δfgas<-132.5kJ/molTherJones, McDonald, et al., 1989

References

Jones, McDonald, et al., 1989
Jones, M.T.; McDonald, R.N.; Schell, P.L.; Ali, M.H., Kinetics and Mechanism of Halogen Atom Transfer Reactions between Haloalkanes and Several 17-Electron Transition Metal Complex Negative Ions in the Gas Phase, J. Am. Chem. Soc., 1989, 111, 16, 5983, https://doi.org/10.1021/ja00198a001 . [all data]