Cl..(CO)4ReCl radical anion

Gas phase thermochemistry data

Data compiled by: John E. Bartmess

Quantity Value Units Method Reference Comment
Δfgas<-50.21kcal/molTherJones, McDonald, et al., 1989

Reaction thermochemistry data

Data compiled by: John E. Bartmess

Individual Reactions

C4ClO4Re + Chlorine atom = C4Cl2O4Re-

By formula: C4ClO4Re + Cl = C4Cl2O4Re-

Quantity Value Units Method Reference Comment
Δr>79.20kcal/molIMRBJones, McDonald, et al., 1989gas phase

References

Jones, McDonald, et al., 1989
Jones, M.T.; McDonald, R.N.; Schell, P.L.; Ali, M.H., Kinetics and Mechanism of Halogen Atom Transfer Reactions between Haloalkanes and Several 17-Electron Transition Metal Complex Negative Ions in the Gas Phase, J. Am. Chem. Soc., 1989, 111, 16, 5983, https://doi.org/10.1021/ja00198a001 . [all data]