EtCH=CH anion

Reaction thermochemistry data

Data compiled by: John E. Bartmess

Individual Reactions

C4H7- + Hydrogen cation = 1-Butene

By formula: C4H7- + H+ = C4H8

Quantity Value Units Method Reference Comment
Δr1707. ± 15.kJ/molCIDTGraul and Squires, 1990gas phase
Quantity Value Units Method Reference Comment
Δr1674. ± 15.kJ/molH-TSGraul and Squires, 1990gas phase

Gas phase ion energetics data

Data compiled by: John E. Bartmess

Protonation reactions

C4H7- + Hydrogen cation = 1-Butene

By formula: C4H7- + H+ = C4H8

Quantity Value Units Method Reference Comment
Δr1707. ± 15.kJ/molCIDTGraul and Squires, 1990gas phase
Quantity Value Units Method Reference Comment
Δr1674. ± 15.kJ/molH-TSGraul and Squires, 1990gas phase

References

Graul and Squires, 1990
Graul, S.T.; Squires, R.R., Gas-Phase Acidities Derived from Threshold Energies for Activated Reactions, J. Am. Chem. Soc., 1990, 112, 7, 2517, https://doi.org/10.1021/ja00163a007 . [all data]