FCH2 anion

Reaction thermochemistry data

Data compiled by: John E. Bartmess

Individual Reactions

CH2F- + Hydrogen cation = Methyl fluoride

By formula: CH2F- + H+ = CH3F

Quantity Value Units Method Reference Comment
Δr1756. ± 19.kJ/molEIAERogers, Simpson, et al., 2010gas phase
Δr1711. ± 17.kJ/molCIDTGraul and Squires, 1990gas phase
Quantity Value Units Method Reference Comment
Δr1676. ± 17.kJ/molH-TSGraul and Squires, 1990gas phase

References

Rogers, Simpson, et al., 2010
Rogers, N.J.; Simpson, M.J.; Tuckett, R.P.; Dunn, K.F.; Latimer, C.J., Vacuum-UV negative photoion spectroscopy of CH3F, CH3Cl and CH3Br, Phys. Chem. Chem. Phys., 2010, 12, 36, 10971-10980, https://doi.org/10.1039/c0cp00234h . [all data]

Graul and Squires, 1990
Graul, S.T.; Squires, R.R., Gas-Phase Acidities Derived from Threshold Energies for Activated Reactions, J. Am. Chem. Soc., 1990, 112, 7, 2517, https://doi.org/10.1021/ja00163a007 . [all data]