bicyclo[1.1.1]pentan-1-ide anion

Reaction thermochemistry data

Data compiled by: John E. Bartmess

Individual Reactions

C5H7- + Hydrogen cation = Bicyclo[1.1.1]pentane

By formula: C5H7- + H+ = C5H8

Quantity Value Units Method Reference Comment
Δr411.0 ± 3.5kcal/molCIDTGraul and Squires, 1990gas phase; Reed, Kass, et al., 2002 claim this is the 1,4-pentadien-2-ide anion
Quantity Value Units Method Reference Comment
Δr402.6 ± 3.6kcal/molH-TSGraul and Squires, 1990gas phase; Reed, Kass, et al., 2002 claim this is the 1,4-pentadien-2-ide anion

References

Graul and Squires, 1990
Graul, S.T.; Squires, R.R., Gas-Phase Acidities Derived from Threshold Energies for Activated Reactions, J. Am. Chem. Soc., 1990, 112, 7, 2517, https://doi.org/10.1021/ja00163a007 . [all data]

Reed, Kass, et al., 2002
Reed, D.R.; Kass, S.R.; Mondanaro, K.R.; Dailey, W.P., Formation of a 1-bicyclo[1.1.1]pentyl anion and an experimental determination of the acidity and C-H bond dissociation energy of 3-tert-butylbicyclo[1.1.1]pentane, J. Am. Chem. Soc., 2002, 124, 11, 2790-2795, https://doi.org/10.1021/ja0121890 . [all data]