CH2=CHOCH2 anion

Gas phase ion energetics data

Data compiled by: John E. Bartmess

Protonation reactions

C3H5O- + Hydrogen cation = Ethene, methoxy-

By formula: C3H5O- + H+ = C3H6O

Quantity Value Units Method Reference Comment
Δr411. ± 12.kcal/molCIDTGraul and Squires, 1990gas phase
Quantity Value Units Method Reference Comment
Δr403. ± 12.kcal/molH-TSGraul and Squires, 1990gas phase

References

Graul and Squires, 1990
Graul, S.T.; Squires, R.R., Gas-Phase Acidities Derived from Threshold Energies for Activated Reactions, J. Am. Chem. Soc., 1990, 112, 7, 2517, https://doi.org/10.1021/ja00163a007 . [all data]