Me2Si(F)CH2 anion

Reaction thermochemistry data

Data compiled by: John E. Bartmess

Individual Reactions

C3H8FSi- + Hydrogen cation = Trimethylsilyl fluoride

By formula: C3H8FSi- + H+ = C3H9FSi

Quantity Value Units Method Reference Comment
Δr1625. ± 20.kJ/molG+TSAllison and McMahon, 1990gas phase; Between H2O, HO.
Quantity Value Units Method Reference Comment
Δr1591. ± 19.kJ/molIMRBAllison and McMahon, 1990gas phase; Between H2O, HO.

Gas phase ion energetics data

Data compiled by: John E. Bartmess

Protonation reactions

C3H8FSi- + Hydrogen cation = Trimethylsilyl fluoride

By formula: C3H8FSi- + H+ = C3H9FSi

Quantity Value Units Method Reference Comment
Δr1625. ± 20.kJ/molG+TSAllison and McMahon, 1990gas phase; Between H2O, HO.
Quantity Value Units Method Reference Comment
Δr1591. ± 19.kJ/molIMRBAllison and McMahon, 1990gas phase; Between H2O, HO.

References

Allison and McMahon, 1990
Allison, C.E.; McMahon, T.B., How Strong is the Si=C Bond in Fluoro- and Methyl Substituted Silaethylenes? An Experimental Determination of Pi Bond Strengths, J. Am. Chem. Soc., 1990, 112, 5, 1672, https://doi.org/10.1021/ja00161a002 . [all data]