HSiO anion

Reaction thermochemistry data

Data compiled by: John E. Bartmess

Individual Reactions

HOSi- + Hydrogen cation = H2OSi

By formula: HOSi- + H+ = H2OSi

Quantity Value Units Method Reference Comment
Δr363.5 ± 8.1kcal/molG+TSGronert, O'Hair, et al., 1990gas phase; Between acetone, nitromethane
Quantity Value Units Method Reference Comment
Δr356.0 ± 8.0kcal/molIMRBGronert, O'Hair, et al., 1990gas phase; Between acetone, nitromethane

References

Gronert, O'Hair, et al., 1990
Gronert, S.; O'Hair, R.A.J.; Prodnuk, S.; Suzle, D.; Damrauer, R.; DePuy, C.H., Gas-Phase Chemistry of the Silaformyl Anion, HSiO-, J. Am. Chem. Soc., 1990, 112, 3, 997, https://doi.org/10.1021/ja00159a016 . [all data]