MeCOCH2CH2CO2 anion

Gas phase ion energetics data

Data compiled by: John E. Bartmess

Electron affinity of neutral species

EAneutral (eV) Method Reference Comment
3.72 ± 0.18D-EAGraul, Schnute, et al., 1990

Protonation reactions

C5H7O3- + Hydrogen cation = Pentanoic acid, 4-oxo-

By formula: C5H7O3- + H+ = C5H8O3

Quantity Value Units Method Reference Comment
Δr340.7 ± 2.9kcal/molG+TSGraul, Schnute, et al., 1990gas phase
Quantity Value Units Method Reference Comment
Δr333.7 ± 2.8kcal/molCIDCGraul, Schnute, et al., 1990gas phase

References

Graul, Schnute, et al., 1990
Graul, S.T.; Schnute, M.E.; Squires, R.R., Gas-Phase Acidities of Carboxylic Acids and Alcohols from Collision-Induced Dissociation of Dimer Cluster Ions, Int. J. Mass Spectrom. Ion Proc., 1990, 96, 2, 181, https://doi.org/10.1016/0168-1176(90)87028-F . [all data]