CH2=CHC(Me)2CH2CO2 anion

Gas phase ion energetics data

Data compiled by: John E. Bartmess

Electron affinity of neutral species

EAneutral (eV) Method Reference Comment
3.67 ± 0.18D-EAGraul, Schnute, et al., 1990

Protonation reactions

C7H11O2- + Hydrogen cation = C7H12O2

By formula: C7H11O2- + H+ = C7H12O2

Quantity Value Units Method Reference Comment
Δr342.0 ± 2.9kcal/molG+TSGraul, Schnute, et al., 1990gas phase
Quantity Value Units Method Reference Comment
Δr335.0 ± 2.8kcal/molCIDCGraul, Schnute, et al., 1990gas phase

Reaction thermochemistry data

Data compiled by: John E. Bartmess

Individual Reactions

C7H11O2- + Hydrogen cation = C7H12O2

By formula: C7H11O2- + H+ = C7H12O2

Quantity Value Units Method Reference Comment
Δr342.0 ± 2.9kcal/molG+TSGraul, Schnute, et al., 1990gas phase
Quantity Value Units Method Reference Comment
Δr335.0 ± 2.8kcal/molCIDCGraul, Schnute, et al., 1990gas phase

References

Graul, Schnute, et al., 1990
Graul, S.T.; Schnute, M.E.; Squires, R.R., Gas-Phase Acidities of Carboxylic Acids and Alcohols from Collision-Induced Dissociation of Dimer Cluster Ions, Int. J. Mass Spectrom. Ion Proc., 1990, 96, 2, 181, https://doi.org/10.1016/0168-1176(90)87028-F . [all data]