CH2=CHCO2 anion

Gas phase ion energetics data

Data compiled by: John E. Bartmess

Electron affinity of neutral species

EAneutral (eV) Method Reference Comment
3.57 ± 0.18D-EAGraul, Schnute, et al., 1990

Protonation reactions

C3H3O2- + Hydrogen cation = 2-Propenoic acid

By formula: C3H3O2- + H+ = C3H4O2

Quantity Value Units Method Reference Comment
Δr1440. ± 12.kJ/molG+TSGraul, Schnute, et al., 1990gas phase
Quantity Value Units Method Reference Comment
Δr1411. ± 12.kJ/molCIDCGraul, Schnute, et al., 1990gas phase

References

Graul, Schnute, et al., 1990
Graul, S.T.; Schnute, M.E.; Squires, R.R., Gas-Phase Acidities of Carboxylic Acids and Alcohols from Collision-Induced Dissociation of Dimer Cluster Ions, Int. J. Mass Spectrom. Ion Proc., 1990, 96, 2, 181, https://doi.org/10.1016/0168-1176(90)87028-F . [all data]