CH2=CHOCH2CH2O anion

Reaction thermochemistry data

Data compiled by: John E. Bartmess

Individual Reactions

C4H7O2- + Hydrogen cation = Ethanol, 2-(vinyloxy)-

By formula: C4H7O2- + H+ = C4H8O2

Quantity Value Units Method Reference Comment
Δr1547. ± 12.kJ/molG+TSGraul, Schnute, et al., 1990gas phase
Quantity Value Units Method Reference Comment
Δr1519. ± 12.kJ/molCIDCGraul, Schnute, et al., 1990gas phase

References

Graul, Schnute, et al., 1990
Graul, S.T.; Schnute, M.E.; Squires, R.R., Gas-Phase Acidities of Carboxylic Acids and Alcohols from Collision-Induced Dissociation of Dimer Cluster Ions, Int. J. Mass Spectrom. Ion Proc., 1990, 96, 2, 181, https://doi.org/10.1016/0168-1176(90)87028-F . [all data]