PhCH2CH2CH2O anion

Gas phase ion energetics data

Data compiled by: John E. Bartmess

Electron affinity of neutral species

EAneutral (eV) Method Reference Comment
2.01 ± 0.15D-EAGraul, Schnute, et al., 1990

Protonation reactions

C9H11O- + Hydrogen cation = 3-Phenylpropanol

By formula: C9H11O- + H+ = C9H12O

Quantity Value Units Method Reference Comment
Δr371.4 ± 2.9kcal/molG+TSGraul, Schnute, et al., 1990gas phase
Quantity Value Units Method Reference Comment
Δr364.8 ± 2.8kcal/molCIDCGraul, Schnute, et al., 1990gas phase

References

Graul, Schnute, et al., 1990
Graul, S.T.; Schnute, M.E.; Squires, R.R., Gas-Phase Acidities of Carboxylic Acids and Alcohols from Collision-Induced Dissociation of Dimer Cluster Ions, Int. J. Mass Spectrom. Ion Proc., 1990, 96, 2, 181, https://doi.org/10.1016/0168-1176(90)87028-F . [all data]