cPrCH2O anion

Reaction thermochemistry data

Data compiled by: John E. Bartmess

Individual Reactions

C4H7O- + Hydrogen cation = Cyclopropyl carbinol

By formula: C4H7O- + H+ = C4H8O

Quantity Value Units Method Reference Comment
Δr1565. ± 12.kJ/molG+TSGraul, Schnute, et al., 1990gas phase
Quantity Value Units Method Reference Comment
Δr1538. ± 12.kJ/molCIDCGraul, Schnute, et al., 1990gas phase

Gas phase ion energetics data

Data compiled by: John E. Bartmess

Electron affinity of neutral species

EAneutral (eV) Method Reference Comment
1.89 ± 0.15D-EAGraul, Schnute, et al., 1990

Protonation reactions

C4H7O- + Hydrogen cation = Cyclopropyl carbinol

By formula: C4H7O- + H+ = C4H8O

Quantity Value Units Method Reference Comment
Δr374.1 ± 2.9kcal/molG+TSGraul, Schnute, et al., 1990gas phase
Quantity Value Units Method Reference Comment
Δr367.5 ± 2.8kcal/molCIDCGraul, Schnute, et al., 1990gas phase

References

Graul, Schnute, et al., 1990
Graul, S.T.; Schnute, M.E.; Squires, R.R., Gas-Phase Acidities of Carboxylic Acids and Alcohols from Collision-Induced Dissociation of Dimer Cluster Ions, Int. J. Mass Spectrom. Ion Proc., 1990, 96, 2, 181, https://doi.org/10.1016/0168-1176(90)87028-F . [all data]