MeOCH2CHCN anion

Reaction thermochemistry data

Data compiled by: John E. Bartmess

Individual Reactions

C4H6NO- + Hydrogen cation = Propanenitrile, 3-methoxy-

By formula: C4H6NO- + H+ = C4H7N

Quantity Value Units Method Reference Comment
Δr1568. ± 8.8kJ/molG+TSBartmess, 1980gas phase
Quantity Value Units Method Reference Comment
Δr1536. ± 8.4kJ/molIMREBartmess, 1980gas phase

Gas phase ion energetics data

Data compiled by: John E. Bartmess

Electron affinity of neutral species

EAneutral (eV) Method Reference Comment
1.25 ± 0.13D-EABartmess, 1980

Protonation reactions

C4H6NO- + Hydrogen cation = Propanenitrile, 3-methoxy-

By formula: C4H6NO- + H+ = C4H7N

Quantity Value Units Method Reference Comment
Δr1568. ± 8.8kJ/molG+TSBartmess, 1980gas phase
Quantity Value Units Method Reference Comment
Δr1536. ± 8.4kJ/molIMREBartmess, 1980gas phase

References

Bartmess, 1980
Bartmess, J.E., Solvent effects on ion-molecule reactions. Vinyl anions vs. conjugate addition, J. Am. Chem. Soc., 1980, 102, 2483. [all data]