Ge7 anion

Gas phase ion energetics data

Data compiled by: John E. Bartmess

Electron affinity of neutral species

EAneutral (eV) Method Reference Comment
1.790 ± 0.060LPESNeigishi, Kawamata, et al., 1997
1.800 ± 0.050LPESBurton, Xu, et al., 1996
1.90 ± 0.20LPESCheshnovsky, Yang, et al., 1987EA given is Vertical Detachment Energy. Adiabatic EA est as up to 1 eV smaller

References

Neigishi, Kawamata, et al., 1997
Neigishi, Y.; Kawamata, H.; Hayase, T.; Gomei, M.; Kishi, R.; Hayakawa, F.; Nakajima, A.; Kaya, K., Photoelectron Spectroscopy of Germanium-Fluorine Binary Cluster Anions: the HOMO-LUMO Gap Estimation of Gen Clusters., Chem. Phys. Lett., 1997, 269, 3-4, 199-207, https://doi.org/10.1016/S0009-2614(97)00284-4 . [all data]

Burton, Xu, et al., 1996
Burton, G.R.; Xu, C.; Arnold, C.C.; Neumark, D.M., Photoelectron Spectroscopy and Zero Kinetic Energy Spectroscopy of Germanium Cluster Anions, J. Chem. Phys., 1996, 104, 8, 2757, https://doi.org/10.1063/1.471098 . [all data]

Cheshnovsky, Yang, et al., 1987
Cheshnovsky, O.; Yang, S.H.; Pettiette, C.L.; Craycraft, M.J.; Liu, Y.; Smalley, R.E., Ultraviolet Photoelectron Spectroscopy of Semiconductor Clusters: Silicon and Germanium, Chem. Phys. Lett., 1987, 138, 2-3, 119, https://doi.org/10.1016/0009-2614(87)80353-6 . [all data]