CH2=C(Me)S anion

Reaction thermochemistry data

Data compiled by: John E. Bartmess

Individual Reactions

C3H5S- + Hydrogen cation = Thioacetone

By formula: C3H5S- + H+ = C3H6S

Quantity Value Units Method Reference Comment
Δr1469. ± 14.kJ/molG+TSZhang and Grabowski, 1989gas phase; Between H2S, PhOH (Acid = Me2C=S)
Quantity Value Units Method Reference Comment
Δr1439. ± 13.kJ/molIMRBZhang and Grabowski, 1989gas phase; Between H2S, PhOH (Acid = Me2C=S)

References

Zhang and Grabowski, 1989
Zhang, L.; Grabowski, J.J., The Gas-Phase Basicity and H/D Exchange Characteristics of the Parent Thiocarbonyl Enolate Anions, J. Chem. Soc. Chem. Comm. 1819, 1989. [all data]