CH2=CHS anion

Reaction thermochemistry data

Data compiled by: John E. Bartmess

Individual Reactions

C2H3S- + Hydrogen cation = Thioacetaldehyde

By formula: C2H3S- + H+ = C2H4S

Quantity Value Units Method Reference Comment
Δr1455. ± 14.kJ/molG+TSZhang and Grabowski, 1989gas phase; Between MeCO2H, EtCO2H (Acid = MeCH=S)
Δr1461. ± 17.kJ/molG+TSGuillemin, Riague, et al., 2005gas phase; Acid: CH3CH=S
Quantity Value Units Method Reference Comment
Δr1427. ± 13.kJ/molIMRBZhang and Grabowski, 1989gas phase; Between MeCO2H, EtCO2H (Acid = MeCH=S)
Δr1432. ± 16.kJ/molIMRBGuillemin, Riague, et al., 2005gas phase; Acid: CH3CH=S

Gas phase ion energetics data

Data compiled by: John E. Bartmess

Protonation reactions

C2H3S- + Hydrogen cation = Thioacetaldehyde

By formula: C2H3S- + H+ = C2H4S

Quantity Value Units Method Reference Comment
Δr1455. ± 14.kJ/molG+TSZhang and Grabowski, 1989gas phase; Between MeCO2H, EtCO2H (Acid = MeCH=S)
Δr1461. ± 17.kJ/molG+TSGuillemin, Riague, et al., 2005gas phase; Acid: CH3CH=S
Quantity Value Units Method Reference Comment
Δr1427. ± 13.kJ/molIMRBZhang and Grabowski, 1989gas phase; Between MeCO2H, EtCO2H (Acid = MeCH=S)
Δr1432. ± 16.kJ/molIMRBGuillemin, Riague, et al., 2005gas phase; Acid: CH3CH=S

References

Zhang and Grabowski, 1989
Zhang, L.; Grabowski, J.J., The Gas-Phase Basicity and H/D Exchange Characteristics of the Parent Thiocarbonyl Enolate Anions, J. Chem. Soc. Chem. Comm. 1819, 1989. [all data]

Guillemin, Riague, et al., 2005
Guillemin, J.C.; Riague, E.H.; Gal, J.F.; Maria, P.C.; Mo, O.; Yanez, M., Acidity trends in alpha,beta-unsaturated sulfur, selenium, and tellurium derivatives: Comparison with C-, Si-, Ge-, Sn-, N-, P-, As-, and Sb-containing analogues, Chem. Eur. J., 2005, 11, 7, 2145-2153, https://doi.org/10.1002/chem.200400989 . [all data]