iPrOH..PhS anion

Gas phase thermochemistry data

Data compiled by: John E. Bartmess

Quantity Value Units Method Reference Comment
Δfgas-329. ± 9.2kJ/molTherSieck and Meot-ner, 1989

Reaction thermochemistry data

Data compiled by: John E. Bartmess

Individual Reactions

thiophenoxide anion + Isopropyl Alcohol = C9H13OS-

By formula: C6H5S- + C3H8O = C9H13OS-

Quantity Value Units Method Reference Comment
Δr62.76 ± 0.42kJ/molTDAsSieck and Meot-ner, 1989gas phase
Quantity Value Units Method Reference Comment
Δr30.5 ± 1.7kJ/molTDAsSieck and Meot-ner, 1989gas phase

Ion clustering data

Data compiled by: John E. Bartmess

Clustering reactions

thiophenoxide anion + Isopropyl Alcohol = C9H13OS-

By formula: C6H5S- + C3H8O = C9H13OS-

Quantity Value Units Method Reference Comment
Δr62.76 ± 0.42kJ/molTDAsSieck and Meot-ner, 1989gas phase
Quantity Value Units Method Reference Comment
Δr30.5 ± 1.7kJ/molTDAsSieck and Meot-ner, 1989gas phase

References

Sieck and Meot-ner, 1989
Sieck, L.W.; Meot-ner, M., Ionic Hydrogen Bond and Ion Solvation. 8. RS-..HOR Bond Strengths. Correlation with Acidities., J. Phys. Chem., 1989, 93, 4, 1586, https://doi.org/10.1021/j100341a079 . [all data]