B2H6..H anion

Gas phase thermochemistry data

Data compiled by: John E. Bartmess

Quantity Value Units Method Reference Comment
Δfgas-130.1kJ/molTherWorkman and Squires, 1988Calculated from data on BH3..BH4-

References

Workman and Squires, 1988
Workman, D.B.; Squires, R.R., Hydride Binding Energies of Boranes, Inorg. Chem., 1988, 27, 11, 1846, https://doi.org/10.1021/ic00284a003 . [all data]