Et3B..H anion

Gas phase thermochemistry data

Data compiled by: John E. Bartmess

Quantity Value Units Method Reference Comment
Δfgas-294.0kJ/molTherWorkman and Squires, 1988From Endo threshold for hydride transfer to CO2

References

Workman and Squires, 1988
Workman, D.B.; Squires, R.R., Hydride Binding Energies of Boranes, Inorg. Chem., 1988, 27, 11, 1846, https://doi.org/10.1021/ic00284a003 . [all data]