HfF5 anion

Gas phase thermochemistry data

Data compiled by: John E. Bartmess

Quantity Value Units Method Reference Comment
Δfgas-2380. ± 17.kJ/molTherNikitin, Igolkina, et al., 1986Reanalyzed literature data, 14.1 kcal < AlF3; value altered from reference due to conversion from electron convention to ion convention

References

Nikitin, Igolkina, et al., 1986
Nikitin, M.I.; Igolkina, N.A.; Skokan, E.V.; Sorokin, I.D.; Sidirov, L.N., Enthalpies of formation of the AlF4- ion, J. Phys. Chem., 1986, 60, 22. [all data]