Ge12 anion

Gas phase ion energetics data

Data compiled by: John E. Bartmess

Electron affinity of neutral species

EAneutral (eV) Method Reference Comment
2.50 ± 0.10LPESNegishi, Kawamata, et al., 1998
2.40 ± 0.20LPESBurton, Xu, et al., 1996
2.60 ± 0.20LPESCheshnovsky, Yang, et al., 1987EA given is Vertical Detachment Energy. Adiabatic EA est as up to 1 eV smaller
<2.90999LPDLiu, Zhang, et al., 1986

References

Negishi, Kawamata, et al., 1998
Negishi, Y.; Kawamata, H.; Hayakawa, F.; Nakajima, A.; Kaya, K., The infrared HOMO-LUMO gap of germanium clusters, Chem. Phys. Lett., 1998, 294, 4-5, 370-376, https://doi.org/10.1016/S0009-2614(98)00874-4 . [all data]

Burton, Xu, et al., 1996
Burton, G.R.; Xu, C.; Arnold, C.C.; Neumark, D.M., Photoelectron Spectroscopy and Zero Kinetic Energy Spectroscopy of Germanium Cluster Anions, J. Chem. Phys., 1996, 104, 8, 2757, https://doi.org/10.1063/1.471098 . [all data]

Cheshnovsky, Yang, et al., 1987
Cheshnovsky, O.; Yang, S.H.; Pettiette, C.L.; Craycraft, M.J.; Liu, Y.; Smalley, R.E., Ultraviolet Photoelectron Spectroscopy of Semiconductor Clusters: Silicon and Germanium, Chem. Phys. Lett., 1987, 138, 2-3, 119, https://doi.org/10.1016/0009-2614(87)80353-6 . [all data]

Liu, Zhang, et al., 1986
Liu, Y.; Zhang, Q.-L.; Tittel, F.K.; Curl, R.F.; Smalley, R.E., Photodetachment and Photofragmentation Studies of Semiconductor Cluster Anions, J. Chem. Phys., 1986, 85, 12, 7434, https://doi.org/10.1063/1.451332 . [all data]