CH2=C(OH)O anion

Gas phase ion energetics data

Data compiled by: John E. Bartmess

Electron affinity of neutral species

EAneutral (eV) Method Reference Comment
1.80 ± 0.17D-EAGrabowski and Cheng, 1989

Protonation reactions

C2H3O2- + Hydrogen cation = Acetic acid

By formula: C2H3O2- + H+ = C2H4O2

Quantity Value Units Method Reference Comment
Δr368.0 ± 3.1kcal/molG+TSGrabowski and Cheng, 1989gas phase
Δr367.8 ± 4.6kcal/molEIAEMuftakhov, Vasil'ev, et al., 1999gas phase
Quantity Value Units Method Reference Comment
Δr361.2 ± 3.0kcal/molIMRBGrabowski and Cheng, 1989gas phase

References

Grabowski and Cheng, 1989
Grabowski, J.J.; Cheng, X., Gas-Phase Formation of the Enolate Monoanion of Acetic Acid by Proton Abstraction, J. Am. Chem. Soc., 1989, 111, 8, 3106, https://doi.org/10.1021/ja00190a078 . [all data]

Muftakhov, Vasil'ev, et al., 1999
Muftakhov, M.V.; Vasil'ev, Y.V.; Mazunov, V.A., Determination of electron affinity of carbonyl radicals by means of negative ion mass spectrometry, Rapid Commun. Mass Spectrom., 1999, 13, 12, 1104-1108, https://doi.org/10.1002/(SICI)1097-0231(19990630)13:12<1104::AID-RCM619>3.0.CO;2-C . [all data]