nC3F7CO2 anion

Gas phase ion energetics data

Data compiled by: John E. Bartmess

Electron affinity of neutral species

EAneutral (eV) Method Reference Comment
4.540224D-EACaldwell, Renneboog, et al., 1989

Protonation reactions

C4F7O2- + Hydrogen cation = Butanoic acid, heptafluoro-

By formula: C4F7O2- + H+ = C4HF7O2

Quantity Value Units Method Reference Comment
Δr1347. ± 9.2kJ/molG+TSCaldwell, Renneboog, et al., 1989gas phase
Quantity Value Units Method Reference Comment
Δr1318. ± 8.4kJ/molIMRECaldwell, Renneboog, et al., 1989gas phase

Reaction thermochemistry data

Data compiled by: John E. Bartmess

Individual Reactions

C4F7O2- + Hydrogen cation = Butanoic acid, heptafluoro-

By formula: C4F7O2- + H+ = C4HF7O2

Quantity Value Units Method Reference Comment
Δr1347. ± 9.2kJ/molG+TSCaldwell, Renneboog, et al., 1989gas phase
Quantity Value Units Method Reference Comment
Δr1318. ± 8.4kJ/molIMRECaldwell, Renneboog, et al., 1989gas phase

References

Caldwell, Renneboog, et al., 1989
Caldwell, G.; Renneboog, R.; Kebarle, P., Gas Phase Acidities of Aliphatic Carboxylic Acids, Based on Measurements of Proton Transfer Equilibria, Can. J. Chem., 1989, 67, 4, 661, https://doi.org/10.1139/v89-092 . [all data]