PhOCH2CO2 anion

Gas phase ion energetics data

Data compiled by: John E. Bartmess

Electron affinity of neutral species

EAneutral (eV) Method Reference Comment
3.84 ± 0.16D-EACaldwell, Renneboog, et al., 1989

Protonation reactions

C8H7O3- + Hydrogen cation = Acetic acid, phenoxy-

By formula: C8H7O3- + H+ = C8H8O3

Quantity Value Units Method Reference Comment
Δr338.0 ± 2.2kcal/molG+TSCaldwell, Renneboog, et al., 1989gas phase
Quantity Value Units Method Reference Comment
Δr331.0 ± 2.0kcal/molIMRECaldwell, Renneboog, et al., 1989gas phase

References

Caldwell, Renneboog, et al., 1989
Caldwell, G.; Renneboog, R.; Kebarle, P., Gas Phase Acidities of Aliphatic Carboxylic Acids, Based on Measurements of Proton Transfer Equilibria, Can. J. Chem., 1989, 67, 4, 661, https://doi.org/10.1139/v89-092 . [all data]