cHxCO2 anion

Reaction thermochemistry data

Data compiled by: John E. Bartmess

Individual Reactions

C7H11O2- + Hydrogen cation = Cyclohexanecarboxylic acid

By formula: C7H11O2- + H+ = C7H12O2

Quantity Value Units Method Reference Comment
Δr1444. ± 9.2kJ/molG+TSCaldwell, Renneboog, et al., 1989gas phase
Quantity Value Units Method Reference Comment
Δr1415. ± 8.4kJ/molIMRECaldwell, Renneboog, et al., 1989gas phase

References

Caldwell, Renneboog, et al., 1989
Caldwell, G.; Renneboog, R.; Kebarle, P., Gas Phase Acidities of Aliphatic Carboxylic Acids, Based on Measurements of Proton Transfer Equilibria, Can. J. Chem., 1989, 67, 4, 661, https://doi.org/10.1139/v89-092 . [all data]