cPnCO2 anion

Reaction thermochemistry data

Data compiled by: John E. Bartmess

Individual Reactions

C6H9O2- + Hydrogen cation = Cyclopentylcarboxylic acid

By formula: C6H9O2- + H+ = C6H10O2

Quantity Value Units Method Reference Comment
Δr345.6 ± 2.2kcal/molG+TSCaldwell, Renneboog, et al., 1989gas phase
Quantity Value Units Method Reference Comment
Δr338.6 ± 2.0kcal/molIMRECaldwell, Renneboog, et al., 1989gas phase

References

Caldwell, Renneboog, et al., 1989
Caldwell, G.; Renneboog, R.; Kebarle, P., Gas Phase Acidities of Aliphatic Carboxylic Acids, Based on Measurements of Proton Transfer Equilibria, Can. J. Chem., 1989, 67, 4, 661, https://doi.org/10.1139/v89-092 . [all data]